Target
Vasopressin V1a receptor
Ligand
BDBM50285301
Substrate
Meas. Tech.
ChEMBL_214549 (CHEMBL820018)
IC50
2340±n/a nM
Citation
 Hobbs, DWGould, NPHoffman, JBClineschmidt, BVPettibone, DJVeber, DFFreidinger, RM Non-peptide oxytocin antagonists: identification and synthesis of a potent camphor aminosuccinimide Bioorg Med Chem Lett 5:119-122 (1995)    Article 
Target
Name:
Vasopressin V1a receptor
Synonyms:
Avpr1a VASOPRESSIN V1A Vasopressin V1a receptor | Vasopressin receptor
Type:
Enzyme Catalytic Domain
Mol. Mass.:
47674.81
Organism:
RAT
Description:
VASOPRESSIN V1A AVPR1A RAT::P30560
Residue:
424
  
Inhibitor
Name:
BDBM50285301
Synonyms:
3-diethylamino-1-[7,7-dimethyl-1-spiro[2,3-dihydro-1H-indene-1,4'-(hexahydropyridine)]-1-ylsulfonylmethyl-(1S,2S)-bicyclo[2.2.1]hept-2-yl]-(3R)-tetrahydro-1H-2,5-pyrroledione | CHEMBL280202
Type:
Small organic molecule
Emp. Form.:
C31H45N3O4S
Mol. Mass.:
555.772
SMILES:
CCN(CC)[C@@H]1CC(=O)N([C@H]2CC3CC[C@]2(CS(=O)(=O)N2CCC4(CCc5ccccc45)CC2)C3(C)C)C1=O
: