Target
Sterol O-acyltransferase 1
Ligand
BDBM50450347
Substrate
Meas. Tech.
ChEBML_28360
IC50
3±n/a nM
Citation
 Wilde, RGBillheimer, JT Acyl CoA:cholesterol acyltransferase (ACAT) inhibitors: ureas bearing two heterocyclic head groups Bioorg Med Chem Lett 5:173-6 (1995)   
Target
Name:
Sterol O-acyltransferase 1
Synonyms:
ACAT-1 Acat SOAT1_RAT Sterol O-acyltransferase, Soat
Type:
PROTEIN
Mol. Mass.:
64165.56
Organism:
Rattus norvegicus
Description:
ChEMBL_28796
Residue:
545
  
Inhibitor
Name:
BDBM50450347
Synonyms:
CHEMBL431940
Type:
Small organic molecule
Emp. Form.:
C51H56F2N8OS2
Mol. Mass.:
899.17
SMILES:
CN(C)c1ccc(cc1)-c1nc(SCCCCCN(CCCCCSc2nc(c([nH]2)-c2ccccc2)-c2ccccc2)C(=O)Nc2ccc(F)cc2F)[nH]c1-c1ccc(cc1)N(C)C
: