Target
Platelet-activating factor receptor
Ligand
BDBM50286005
Substrate
Meas. Tech.
ChEBML_155158
Ki
180±n/a nM
Citation
 Holms, JHDavidsen, SKSheppard, GSCarrera, GMCurtin, NLHeyman, HRPireh, DSteinman, DHAlbert, DHConway, RGLuo, GMagoc, TJTapang, PRhein, DASummers, JB Discovery and optimization of indole pyrrolothiazole paf antagonists Bioorg Med Chem Lett 5:2903-2908 (1995)    Article 
Target
Name:
Platelet-activating factor receptor
Synonyms:
PAF-R PTAFR_CAVPO Platelet-activating factor receptor
Type:
Protein
Mol. Mass.:
39005.63
Organism:
Cavia porcellus
Description:
Residue:
342
  
Inhibitor
Name:
BDBM50286005
Synonyms:
(5-Benzyloxy-1H-indol-3-yl)-(3-pyridin-3-yl-1H-pyrrolo[1,2-c]thiazol-7-yl)-methanone | CHEMBL329508
Type:
Small organic molecule
Emp. Form.:
C27H21N3O2S
Mol. Mass.:
451.54
SMILES:
O=C(c1ccn2C(SCc12)c1cccnc1)c1c[nH]c2ccc(OCc3ccccc3)cc12
: