Target
5-hydroxytryptamine receptor 1D
Ligand
BDBM50286670
Substrate
Meas. Tech.
ChEBML_2037
Ki
0.520000±n/a nM
Citation
 Perez, MPauwels, PPalmier, CJohn, GWValentin, JPHalazy, S 5-O-Carboxymethyl piperazide derivatives of serotonin: a new class of potent and selective 5-HT1D receptor agonists Bioorg Med Chem Lett 5:663-666 (1995)    Article 
Target
Name:
5-hydroxytryptamine receptor 1D
Synonyms:
5-HT-1D 5-HT1D 5HT1D_HUMAN HTR1DA Serotonin (5-HT) receptor | Serotonin Receptor 1D
Type:
G Protein-Coupled Receptor (GPCR)
Mol. Mass.:
41920.63
Organism:
Homo sapiens (Human)
Description:
Receptor binding assays were performed using human clone stably expressed in CHO cells.
Residue:
377
  
Inhibitor
Name:
BDBM50286670
Synonyms:
2-[3-(2-Amino-ethyl)-1H-indol-5-yloxy]-1-(4-naphthalen-1-yl-piperazin-1-yl)-ethanone | CHEMBL160581
Type:
Small organic molecule
Emp. Form.:
C26H28N4O2
Mol. Mass.:
428.5261
SMILES:
NCCc1c[nH]c2ccc(OCC(=O)N3CCN(CC3)c3cccc4ccccc34)cc12
: