Target
Retinoic acid receptor alpha
Ligand
BDBM50287964
Substrate
Meas. Tech.
ChEMBL_195326 (CHEMBL799721)
Kd
>1000±n/a nM
Citation
 Vuligonda, VLin, YChandraratna, RA Synthesis of highly potent RXR-specific retinoids: The use of a cyclopropyl group as a double bond isostere Bioorg Med Chem Lett 6:213-218 (1996)    Article 
Target
Name:
Retinoic acid receptor alpha
Synonyms:
NR1B1 RAR-alpha RARA_HUMAN Retinoic acid receptor alpha/Retinoid X receptor alpha Retinoid receptor
Type:
PROTEIN
Mol. Mass.:
50778.87
Organism:
Homo sapiens (Human)
Description:
ChEMBL_1466191
Residue:
462
  
Inhibitor
Name:
BDBM50287964
Synonyms:
(E)-3-Methyl-5-[2-methyl-2-(3,5,5,8,8-pentamethyl-5,6,7,8-tetrahydro-naphthalen-2-yl)-cyclopropyl]-penta-2,4-dienoic acid | CHEMBL308883
Type:
Small organic molecule
Emp. Form.:
C25H34O2
Mol. Mass.:
366.5363
SMILES:
C\C(\C=C\C1CC1(C)c1cc2c(cc1C)C(C)(C)CCC2(C)C)=C/C(O)=O
: