Target
Retinoic acid receptor beta
Ligand
BDBM50287964
Substrate
Meas. Tech.
ChEMBL_195656 (CHEMBL796051)
EC50
>1000±n/a nM
Citation
 Vuligonda, VLin, YChandraratna, RA Synthesis of highly potent RXR-specific retinoids: The use of a cyclopropyl group as a double bond isostere Bioorg Med Chem Lett 6:213-218 (1996)    Article 
Target
Name:
Retinoic acid receptor beta
Synonyms:
HAP NR1B2 RAR-beta RARB Retinoic acid receptor RXR-alpha/Retinoic acid receptor beta Retinoid receptor
Type:
PROTEIN
Mol. Mass.:
50498.70
Organism:
Homo sapiens (Human)
Description:
ChEMBL_1458015
Residue:
455
  
Inhibitor
Name:
BDBM50287964
Synonyms:
(E)-3-Methyl-5-[2-methyl-2-(3,5,5,8,8-pentamethyl-5,6,7,8-tetrahydro-naphthalen-2-yl)-cyclopropyl]-penta-2,4-dienoic acid | CHEMBL308883
Type:
Small organic molecule
Emp. Form.:
C25H34O2
Mol. Mass.:
366.5363
SMILES:
C\C(\C=C\C1CC1(C)c1cc2c(cc1C)C(C)(C)CCC2(C)C)=C/C(O)=O
: