Target
Substance-P receptor
Ligand
BDBM50287397
Substrate
Meas. Tech.
ChEBML_144909
IC50
12±n/a nM
Citation
 Veenstra, SJHauser, KSchilling, WBetschart, COfner, S SAR of 2-benzyl-4-aminopiperidines NK1 antagonists. Part 21. synthesis of CGP 49823 Bioorg Med Chem Lett 6:3029-3034 (1996)    Article 
Target
Name:
Substance-P receptor
Synonyms:
NK-1 receptor NK1 Receptor NK1R_HUMAN Neurokinin-1 (NK-1) SPR TACR1 Tachykinin receptor 1 (NK1) | tachykinin
Type:
G Protein-Coupled Receptor (GPCR)
Mol. Mass.:
46254.43
Organism:
Homo sapiens (Human)
Description:
P25103
Residue:
407
  
Inhibitor
Name:
BDBM50287397
Synonyms:
CGP-49823 {(2R,4S)-2-Benzyl-4-[(quinolin-4-ylmethyl)-amino]-piperidin-1-yl}-(3,5-dimethyl-phenyl)-methanone | {(R)-2-Benzyl-4-[(quinolin-4-ylmethyl)-amino]-piperidin-1-yl}-(3,5-dimethyl-phenyl)-methanone
Type:
Small organic molecule
Emp. Form.:
C31H33N3O
Mol. Mass.:
463.6132
SMILES:
Cc1cc(C)cc(c1)C(=O)N1CC[C@@H](C[C@H]1Cc1ccccc1)NCc1ccnc2ccccc12
: