Target
Substance-P receptor
Ligand
BDBM50288570
Substrate
Meas. Tech.
ChEBML_144909
IC50
14±n/a nM
Citation
 Veenstra, SJHauser, KSchilling, WBetschart, COfner, S SAR of 2-benzyl-4-aminopiperidines NK1 antagonists. Part 21. synthesis of CGP 49823 Bioorg Med Chem Lett 6:3029-3034 (1996)    Article 
Target
Name:
Substance-P receptor
Synonyms:
NK-1 receptor NK1 Receptor NK1R_HUMAN Neurokinin-1 (NK-1) SPR TACR1 Tachykinin receptor 1 (NK1) | tachykinin
Type:
G Protein-Coupled Receptor (GPCR)
Mol. Mass.:
46254.43
Organism:
Homo sapiens (Human)
Description:
P25103
Residue:
407
  
Inhibitor
Name:
BDBM50288570
Synonyms:
(3,5-Dimethyl-phenyl)-{(2R,4S)-2-(4-methoxy-benzyl)-4-[(quinolin-4-ylmethyl)-amino]-piperidin-1-yl}-methanone | CHEMBL319700
Type:
Small organic molecule
Emp. Form.:
C32H35N3O2
Mol. Mass.:
493.6392
SMILES:
COc1ccc(C[C@@H]2C[C@H](CCN2C(=O)c2cc(C)cc(C)c2)NCc2ccnc3ccccc23)cc1
: