Target
Peptidyl-prolyl cis-trans isomerase FKBP1A
Ligand
BDBM50288762
Substrate
Meas. Tech.
ChEBML_195891
Ki
280±n/a nM
Citation
 Babine, REBleckman, TMLittlefield, ESParge, HEPelletier, LALewis, CTFrench, JVImbacuan, MKatoh, STatlock, JHShowalter, REVillafranca, JE Design, synthesis and X-ray crystallographic studies of [7.3.1] and [8.3.1] macrocyclic FKBP-12 ligands Bioorg Med Chem Lett 6:385-390 (1996)    Article 
Target
Name:
Peptidyl-prolyl cis-trans isomerase FKBP1A
Synonyms:
12 kDa FK506-binding protein FK506-binding protein 1A FKB1A_HUMAN FKBP-1A FKBP12 Immunophilin FKBP12 PPIase FKBP1A Rotamase mTOR/FKBP12A/FKBP12B
Type:
Isomerase
Mol. Mass.:
11953.09
Organism:
Homo sapiens (Human)
Description:
P62942
Residue:
108
  
Inhibitor
Name:
BDBM50288762
Synonyms:
(1S,10R)-14-[2-Oxo-2-(3,4,5-trimethoxy-phenyl)-acetyl]-3,8-dioxa-14-aza-bicyclo[8.3.1]tetradecane-2,9-dione | CHEMBL126473
Type:
Small organic molecule
Emp. Form.:
C22H27NO9
Mol. Mass.:
449.4511
SMILES:
COc1cc(cc(OC)c1OC)C(=O)C(=O)N1[C@@H]2CCC[C@H]1C(=O)OCCCCOC2=O
: