Target
Small conductance calcium-activated potassium channel protein 2
Ligand
BDBM50084851
Substrate
Meas. Tech.
ChEBML_200081
IC50
180±n/a nM
Citation
 Rosa, JCBeckwith-Hall, BMGalanakis, DGanellin, CRDunn, PMJenkinson, DH Bis-quinolinium cyclophanes: A novel class of potent blockers of the apamin-sensitive Ca2+-activated K+ channel Bioorg Med Chem Lett 7:7-10 (1997)    Article 
Target
Name:
Small conductance calcium-activated potassium channel protein 2
Synonyms:
KCNN2_RAT Small conductance calcium-activated potassium channel Small conductance calcium-activated potassium channel protein 2 (KCa2.2)
Type:
Protein
Mol. Mass.:
63876.72
Organism:
Rattus norvegicus (Rat)
Description:
P70604
Residue:
580
  
Inhibitor
Name:
BDBM50084851
Synonyms:
Bis-quinolinium cyclophane analogue Cyclo N-decane(1-{4-[4-(4-amino-1-quinoliniumylmethyl)phenethyl]benzyl}-4-quinoliniumamine)
Type:
Small organic molecule
Emp. Form.:
C44H50N4
Mol. Mass.:
634.8935
SMILES:
C1CCCCCN[c+]2ccn(Cc3ccc(CCc4ccc(Cn5cc[c+](NCCCC1)c1ccccc51)cc4)cc3)c1ccccc21
: