Target
Small conductance calcium-activated potassium channel protein 2
Ligand
BDBM50048412
Substrate
Meas. Tech.
ChEBML_200081
IC50
700±n/a nM
Citation
 Rosa, JCBeckwith-Hall, BMGalanakis, DGanellin, CRDunn, PMJenkinson, DH Bis-quinolinium cyclophanes: A novel class of potent blockers of the apamin-sensitive Ca2+-activated K+ channel Bioorg Med Chem Lett 7:7-10 (1997)    Article 
Target
Name:
Small conductance calcium-activated potassium channel protein 2
Synonyms:
KCNN2_RAT Small conductance calcium-activated potassium channel Small conductance calcium-activated potassium channel protein 2 (KCa2.2)
Type:
Protein
Mol. Mass.:
63876.72
Organism:
Rattus norvegicus (Rat)
Description:
P70604
Residue:
580
  
Inhibitor
Name:
BDBM50048412
Synonyms:
4N-[10-(1-benzyl-4-quinoliniumylamino)decyl]-1-benzyl-4-quinoliniumamine | CHEMBL6212
Type:
Small organic molecule
Emp. Form.:
C42H48N4
Mol. Mass.:
608.8562
SMILES:
C(CCCCC\[NH+]=c1/ccn(Cc2ccccc2)c2ccccc12)CCCC\[NH+]=c1/ccn(Cc2ccccc2)c2ccccc12
: