Target
Small conductance calcium-activated potassium channel protein 2
Ligand
BDBM50054103
Substrate
Meas. Tech.
ChEBML_200081
IC50
380±n/a nM
Citation
 Rosa, JCBeckwith-Hall, BMGalanakis, DGanellin, CRDunn, PMJenkinson, DH Bis-quinolinium cyclophanes: A novel class of potent blockers of the apamin-sensitive Ca2+-activated K+ channel Bioorg Med Chem Lett 7:7-10 (1997)    Article 
Target
Name:
Small conductance calcium-activated potassium channel protein 2
Synonyms:
KCNN2_RAT Small conductance calcium-activated potassium channel Small conductance calcium-activated potassium channel protein 2 (KCa2.2)
Type:
Protein
Mol. Mass.:
63876.72
Organism:
Rattus norvegicus (Rat)
Description:
P70604
Residue:
580
  
Inhibitor
Name:
BDBM50054103
Synonyms:
1,1'-[biphenyl-4,4'-diylbis(methylene)]-bis(4-aminoquinolinium) CHEMBL269729 | CHEMBL370040
Type:
Small organic molecule
Emp. Form.:
C32H28N4
Mol. Mass.:
468.5904
SMILES:
[NH2+]=c1ccn(Cc2ccc(cc2)-c2ccc(Cn3ccc(=[NH2+])c4ccccc34)cc2)c2ccccc12
: