Target
Small conductance calcium-activated potassium channel protein 2
Ligand
BDBM50084852
Substrate
Meas. Tech.
ChEBML_200081
IC50
110±n/a nM
Citation
 Rosa, JCBeckwith-Hall, BMGalanakis, DGanellin, CRDunn, PMJenkinson, DH Bis-quinolinium cyclophanes: A novel class of potent blockers of the apamin-sensitive Ca2+-activated K+ channel Bioorg Med Chem Lett 7:7-10 (1997)    Article 
Target
Name:
Small conductance calcium-activated potassium channel protein 2
Synonyms:
KCNN2_RAT Small conductance calcium-activated potassium channel Small conductance calcium-activated potassium channel protein 2 (KCa2.2)
Type:
Protein
Mol. Mass.:
63876.72
Organism:
Rattus norvegicus (Rat)
Description:
P70604
Residue:
580
  
Inhibitor
Name:
BDBM50084852
Synonyms:
1,14-diazonia-22,33-diazaheptacyclo[32.6.2.214,21.13,7.18,12.015,20.035,40]hexatetraconta-1(40),3,5,7(46),8(45),9,11,14,15,17,19,21(43),34,36,38,41-hexadecaene CHEMBL268556
Type:
Small organic molecule
Emp. Form.:
C42H46N4
Mol. Mass.:
606.8403
SMILES:
C1CCCCCN[c+]2ccn(Cc3cccc(c3)-c3cccc(Cn4cc[c+](NCCCC1)c1ccccc41)c3)c1ccccc21
: