Target
Small conductance calcium-activated potassium channel protein 2
Ligand
BDBM50054095
Substrate
Meas. Tech.
ChEBML_200081
IC50
410±n/a nM
Citation
 Rosa, JCBeckwith-Hall, BMGalanakis, DGanellin, CRDunn, PMJenkinson, DH Bis-quinolinium cyclophanes: A novel class of potent blockers of the apamin-sensitive Ca2+-activated K+ channel Bioorg Med Chem Lett 7:7-10 (1997)    Article 
Target
Name:
Small conductance calcium-activated potassium channel protein 2
Synonyms:
KCNN2_RAT Small conductance calcium-activated potassium channel Small conductance calcium-activated potassium channel protein 2 (KCa2.2)
Type:
Protein
Mol. Mass.:
63876.72
Organism:
Rattus norvegicus (Rat)
Description:
P70604
Residue:
580
  
Inhibitor
Name:
BDBM50054095
Synonyms:
1-{4-[4-(4-amino-1-quinoliniumylmethyl)phenethyl]benzyl}-4-quinoliniumamine CHEMBL362961 | CHEMBL429017
Type:
Small organic molecule
Emp. Form.:
C34H32N4
Mol. Mass.:
496.6436
SMILES:
[NH2+]=c1ccn(Cc2ccc(CCc3ccc(Cn4ccc(=[NH2+])c5ccccc45)cc3)cc2)c2ccccc12
: