Target
Aldo-keto reductase family 1 member B1
Ligand
BDBM50289619
Substrate
Meas. Tech.
ChEBML_31798
IC50
12±n/a nM
Citation
 Aotsuka, TAbe, NFukushima, KAshizawa, NYoshida, M Benzothiazol-2-ylcarboxylic acids with diverse spacers: A novel class of potent, orally active aldose reductase inhibitors Bioorg Med Chem Lett 7:1677-1682 (1997)    Article 
Target
Name:
Aldo-keto reductase family 1 member B1
Synonyms:
AKR1B1 ALR2 Aldose reductase
Type:
PROTEIN
Mol. Mass.:
35865.31
Organism:
Sus scrofa
Description:
ChEMBL_502637
Residue:
316
  
Inhibitor
Name:
BDBM50289619
Synonyms:
CHEMBL542104 | [3-Dimethylamino-5-(4,5,7-trifluoro-benzothiazol-2-ylmethyl)-phenyl]-acetic acid; hydrochloride
Type:
Small organic molecule
Emp. Form.:
C18H15F3N2O2S
Mol. Mass.:
380.384
SMILES:
CN(C)c1cc(CC(O)=O)cc(Cc2nc3c(F)c(F)cc(F)c3s2)c1
: