Target
Aldo-keto reductase family 1 member B1
Ligand
BDBM50289622
Substrate
Meas. Tech.
ChEBML_31798
IC50
23±n/a nM
Citation
 Aotsuka, TAbe, NFukushima, KAshizawa, NYoshida, M Benzothiazol-2-ylcarboxylic acids with diverse spacers: A novel class of potent, orally active aldose reductase inhibitors Bioorg Med Chem Lett 7:1677-1682 (1997)    Article 
Target
Name:
Aldo-keto reductase family 1 member B1
Synonyms:
AKR1B1 ALR2 Aldose reductase
Type:
PROTEIN
Mol. Mass.:
35865.31
Organism:
Sus scrofa
Description:
ChEMBL_502637
Residue:
316
  
Inhibitor
Name:
BDBM50289622
Synonyms:
CHEMBL44941 | {Benzyl-[3-(4,5,7-trifluoro-benzothiazol-2-yl)-thiopropionyl]-amino}-acetic acid
Type:
Small organic molecule
Emp. Form.:
C19H15F3N2O2S2
Mol. Mass.:
424.46
SMILES:
OC(=O)CN(Cc1ccccc1)C(=S)CCc1nc2c(F)c(F)cc(F)c2s1
: