Target
Aldo-keto reductase family 1 member B1
Ligand
BDBM50289626
Substrate
Meas. Tech.
ChEBML_31798
IC50
19±n/a nM
Citation
 Aotsuka, TAbe, NFukushima, KAshizawa, NYoshida, M Benzothiazol-2-ylcarboxylic acids with diverse spacers: A novel class of potent, orally active aldose reductase inhibitors Bioorg Med Chem Lett 7:1677-1682 (1997)    Article 
Target
Name:
Aldo-keto reductase family 1 member B1
Synonyms:
AKR1B1 ALR2 Aldose reductase
Type:
PROTEIN
Mol. Mass.:
35865.31
Organism:
Sus scrofa
Description:
ChEMBL_502637
Residue:
316
  
Inhibitor
Name:
BDBM50289626
Synonyms:
CHEMBL297861 | [2-(4,5,7-Trifluoro-benzothiazol-2-ylmethyl)-phenyl]-acetic acid
Type:
Small organic molecule
Emp. Form.:
C16H10F3NO2S
Mol. Mass.:
337.316
SMILES:
OC(=O)Cc1ccccc1Cc1nc2c(F)c(F)cc(F)c2s1
: