Target
Aldo-keto reductase family 1 member B1
Ligand
BDBM50289627
Substrate
Meas. Tech.
ChEBML_31798
IC50
50±n/a nM
Citation
 Aotsuka, TAbe, NFukushima, KAshizawa, NYoshida, M Benzothiazol-2-ylcarboxylic acids with diverse spacers: A novel class of potent, orally active aldose reductase inhibitors Bioorg Med Chem Lett 7:1677-1682 (1997)    Article 
Target
Name:
Aldo-keto reductase family 1 member B1
Synonyms:
AKR1B1 ALR2 Aldose reductase
Type:
PROTEIN
Mol. Mass.:
35865.31
Organism:
Sus scrofa
Description:
ChEMBL_502637
Residue:
316
  
Inhibitor
Name:
BDBM50289627
Synonyms:
6-(4,5,7-Trifluoro-benzothiazol-2-yl)-hexanoic acid | CHEMBL431145
Type:
Small organic molecule
Emp. Form.:
C13H12F3NO2S
Mol. Mass.:
303.3
SMILES:
OC(=O)CCCCCc1nc2c(F)c(F)cc(F)c2s1
: