Target
Aldo-keto reductase family 1 member B1
Ligand
BDBM50289628
Substrate
Meas. Tech.
ChEBML_31798
IC50
8.7±n/a nM
Citation
 Aotsuka, TAbe, NFukushima, KAshizawa, NYoshida, M Benzothiazol-2-ylcarboxylic acids with diverse spacers: A novel class of potent, orally active aldose reductase inhibitors Bioorg Med Chem Lett 7:1677-1682 (1997)    Article 
Target
Name:
Aldo-keto reductase family 1 member B1
Synonyms:
AKR1B1 ALR2 Aldose reductase
Type:
PROTEIN
Mol. Mass.:
35865.31
Organism:
Sus scrofa
Description:
ChEMBL_502637
Residue:
316
  
Inhibitor
Name:
BDBM50289628
Synonyms:
3-Carboxymethyl-5-(4,5,7-trifluoro-benzothiazol-2-ylmethyl)-benzoic acid | CHEMBL45074
Type:
Small organic molecule
Emp. Form.:
C17H10F3NO4S
Mol. Mass.:
381.326
SMILES:
OC(=O)Cc1cc(Cc2nc3c(F)c(F)cc(F)c3s2)cc(c1)C(O)=O
: