Target
Prolyl endopeptidase
Ligand
BDBM50289637
Substrate
Meas. Tech.
ChEBML_157480
IC50
38±n/a nM
Citation
 Károly, KSándor, EsEdit, SMiklós, FJudit, SBenjámin, PAndrea, SIstván, H Prolyl endopeptidase inhibitors1: N-acyl derivatives of L-thioproline-pyrrolidine Bioorg Med Chem Lett 7:1701-1704 (1997)    Article 
Target
Name:
Prolyl endopeptidase
Synonyms:
PPCE_RAT | Prep
Type:
PROTEIN
Mol. Mass.:
80731.99
Organism:
Rattus norvegicus
Description:
ChEMBL_1336163
Residue:
710
  
Inhibitor
Name:
BDBM50289637
Synonyms:
1-[(R)-4-(Pyrrolidine-1-carbonyl)-thiazolidin-3-yl]-decan-1-one | CHEMBL47565
Type:
Small organic molecule
Emp. Form.:
C18H32N2O2S
Mol. Mass.:
340.524
SMILES:
CCCCCCCCCC(=O)N1CSC[C@H]1C(=O)N1CCCC1
: