Target
Prolyl endopeptidase
Ligand
BDBM50289640
Substrate
Meas. Tech.
ChEBML_157480
IC50
167±n/a nM
Citation
 Károly, KSándor, EsEdit, SMiklós, FJudit, SBenjámin, PAndrea, SIstván, H Prolyl endopeptidase inhibitors1: N-acyl derivatives of L-thioproline-pyrrolidine Bioorg Med Chem Lett 7:1701-1704 (1997)    Article 
Target
Name:
Prolyl endopeptidase
Synonyms:
PPCE_RAT | Prep
Type:
PROTEIN
Mol. Mass.:
80731.99
Organism:
Rattus norvegicus
Description:
ChEMBL_1336163
Residue:
710
  
Inhibitor
Name:
BDBM50289640
Synonyms:
1-[(R)-4-(Pyrrolidine-1-carbonyl)-thiazolidin-3-yl]-butan-1-one | CHEMBL47932
Type:
Small organic molecule
Emp. Form.:
C12H20N2O2S
Mol. Mass.:
256.364
SMILES:
CCCC(=O)N1CSC[C@H]1C(=O)N1CCCC1
: