Target
Retinoic acid receptor RXR-gamma
Ligand
BDBM50290189
Substrate
Meas. Tech.
ChEMBL_35147 (CHEMBL648510)
EC50
204±n/a nM
Citation
 Farmer, LJJeong, SKallel, EAKoch, SSCroston, GEFlatten, KSHeyman, RANadzan, AM Synthesis and structure-activity relationships of potent retinoid X receptor ligands Bioorg Med Chem Lett 7:2393-2398 (1997)    Article 
Target
Name:
Retinoic acid receptor RXR-gamma
Synonyms:
Nr2b3 Retinoid X receptor gamma | Rxrg
Type:
PROTEIN
Mol. Mass.:
50900.28
Organism:
Mus musculus
Description:
ChEMBL_196589
Residue:
463
  
Inhibitor
Name:
BDBM50290189
Synonyms:
(2E,4E)-3-Methyl-5-[(1S,2S)-4-methylene-2-(5,5,8,8-tetramethyl-5,6,7,8-tetrahydro-naphthalen-2-yl)-cyclopentyl]-penta-2,4-dienoic acid | CHEMBL80424
Type:
Small organic molecule
Emp. Form.:
C26H34O2
Mol. Mass.:
378.547
SMILES:
C\C(\C=C\[C@@H]1CC(=C)C[C@@H]1c1ccc2c(c1)C(C)(C)CCC2(C)C)=C/C(O)=O
: