Target
3-hydroxy-3-methylglutaryl-coenzyme A reductase
Ligand
BDBM50292396
Substrate
Meas. Tech.
ChEMBL_503507 (CHEMBL991179)
IC50
3000±n/a nM
Citation
 Patil, ADChan, JALois-Flamberg, PMayer, RJWestley, JW Novel Acetylenic Acids from the Root Bark of Paramacrolobium caeruleum: Inhibitors of 3-Hydroxy-3-methyl-glutaryl Coenzyme A Reductase J Nat Prod 52:153-161 (1989)    Article 
Target
Name:
3-hydroxy-3-methylglutaryl-coenzyme A reductase
Synonyms:
3-hydroxy-3-methylglutaryl-coenzyme A (HMG-CoA) reductase HMDH_HUMAN HMG-CoA reductase (HMGR) | HMGCR
Type:
Enzyme
Mol. Mass.:
97477.10
Organism:
Homo sapiens (Human)
Description:
P04035
Residue:
888
  
Inhibitor
Name:
BDBM50292396
Synonyms:
(Z)-7-octedecan-9-ynoic acid | CHEMBL482601
Type:
Small organic molecule
Emp. Form.:
C18H30O2
Mol. Mass.:
278.4296
SMILES:
CCCCCCCCC#C\C=C/CCCCCC(O)=O
: