Target
3-hydroxy-3-methylglutaryl-coenzyme A reductase
Ligand
BDBM50292398
Substrate
Meas. Tech.
ChEMBL_503507 (CHEMBL991179)
IC50
500±n/a nM
Citation
 Patil, ADChan, JALois-Flamberg, PMayer, RJWestley, JW Novel Acetylenic Acids from the Root Bark of Paramacrolobium caeruleum: Inhibitors of 3-Hydroxy-3-methyl-glutaryl Coenzyme A Reductase J Nat Prod 52:153-161 (1989)    Article 
Target
Name:
3-hydroxy-3-methylglutaryl-coenzyme A reductase
Synonyms:
3-hydroxy-3-methylglutaryl-coenzyme A (HMG-CoA) reductase HMDH_HUMAN HMG-CoA reductase (HMGR) | HMGCR
Type:
Enzyme
Mol. Mass.:
97477.10
Organism:
Homo sapiens (Human)
Description:
P04035
Residue:
888
  
Inhibitor
Name:
BDBM50292398
Synonyms:
(E)-5-octadecen-7,9-diynoic acid | CHEMBL489540
Type:
Small organic molecule
Emp. Form.:
C18H26O2
Mol. Mass.:
274.3978
SMILES:
CCCCCCCCC#CC#C\C=C\CCCC(O)=O
: