Target
Galanin receptor type 1
Ligand
BDBM50293030
Substrate
Meas. Tech.
ChEMBL_518781 (CHEMBL960417)
Ki
0.700000±n/a nM
Citation
 Zhang, LRobertson, CRGreen, BRPruess, THWhite, HSBulaj, G Structural requirements for a lipoamino acid in modulating the anticonvulsant activities of systemically active galanin analogues. J Med Chem 52:1310-6 (2009)  
Target
Name:
Galanin receptor type 1
Synonyms:
GAL1-R GALNR1 GALR1_HUMAN Galanin receptor 1 | Galanin receptor type 1
Type:
Enzyme Catalytic Domain
Mol. Mass.:
38976.60
Organism:
Homo sapiens (Human)
Description:
Galanin R1 GALR1 HUMAN::P47211
Residue:
349
  
Inhibitor
Name:
BDBM50293030
Synonyms:
(Sar)WTLNSAGYLLGPKK(Lys-octanoyl)K | CHEMBL503900
Type:
Small organic molecule
Emp. Form.:
C96H157N23O23
Mol. Mass.:
2001.4141
SMILES:
CCCCCCCC(=O)NCCCC[C@H](NC(=O)[C@H](CCCCN)NC(=O)[C@H](CCCCN)NC(=O)[C@@H]1CCCN1C(=O)CNC(=O)[C@H](CC(C)C)NC(=O)[C@H](CC(C)C)NC(=O)[C@H](Cc1ccc(O)cc1)NC(=O)CNC(=O)[C@H](C)NC(=O)[C@H](CO)NC(=O)[C@H](CC(N)=O)NC(=O)[C@H](CC(C)C)NC(=O)[C@@H](NC(=O)[C@H](Cc1c[nH]c2ccccc12)OC(=O)CNC)[C@@H](C)O)C(=O)N[C@@H](CCCCN)C(N)=O
: