Target
Melanin-concentrating hormone receptor 1
Ligand
BDBM50293480
Substrate
Meas. Tech.
ChEMBL_570542 (CHEMBL1026914)
Ki
312±n/a nM
Citation
 Abu-Hammad, AZalloum, WAZalloum, HAbu-Sheikha, GTaha, MO Homology modeling of MCH1 receptor and validation by docking/scoring and protein-aligned CoMFA. Eur J Med Chem 44:2583-96 (2009)  
Target
Name:
Melanin-concentrating hormone receptor 1
Synonyms:
G-protein coupled receptor 24 MCH receptor 1 MCH-R1 MCHR-1 MCHR1_HUMAN Melanin-Concentrating Hormone Receptor 1 (MCH1R) Melanin-concentrating hormone receptor 1 (MCH-1) Melanin-concentrating hormone receptor 1 (MCHR-1) SLC-1 Somatostatin receptor-like protein
Type:
G Protein-Coupled Receptor (GPCR)
Mol. Mass.:
45976.27
Organism:
Homo sapiens (Human)
Description:
Membranes from CHO-K1 cells stably expressing human MCH1R were used in assays.
Residue:
422
  
Inhibitor
Name:
BDBM50293480
Synonyms:
(R)-N-(1-(4-iodophenyl)propyl)-4-((1-(quinolin-2-ylmethyl)piperidin-4-yl)methyl)benzamide | CHEMBL555875
Type:
Small organic molecule
Emp. Form.:
C32H34IN3O
Mol. Mass.:
603.5363
SMILES:
CC[C@@H](NC(=O)c1ccc(CC2CCN(Cc3ccc4ccccc4n3)CC2)cc1)c1ccc(I)cc1
: