Target
Cytochrome P450 3A4
Ligand
BDBM50293600
Substrate
Meas. Tech.
ChEMBL_571408 (CHEMBL1029448)
Ki
260±n/a nM
Citation
 McNulty, JNair, JJSingh, MCrankshaw, DJHolloway, ACBastida, J Selective cytochrome P450 3A4 inhibitory activity of Amaryllidaceae alkaloids. Bioorg Med Chem Lett 19:3233-7 (2009)  
Target
Name:
Cytochrome P450 3A4
Synonyms:
Albendazole monooxygenase CP3A4_HUMAN CYP3A4 CYPIIIA4 Cytochrome P450 3A4 (CYP3A4) Nifedipine oxidase Taurochenodeoxycholate 6-alpha-hydroxylase
Type:
Enzyme
Mol. Mass.:
57349.57
Organism:
Homo sapiens (Human)
Description:
Residue:
503
  
Inhibitor
Name:
BDBM50293600
Synonyms:
(1S,2S,3a1S,12bS)-2-(tert-butyldimethylsilyloxy)-2,3a1,4,5,7,12b-hexahydro-1H-[1,3]dioxolo[4,5-j]pyrrolo[3,2,1-de]phenanthridin-1-ol CHEMBL558873
Type:
Small organic molecule
Emp. Form.:
C22H31NO4Si
Mol. Mass.:
401.5713
SMILES:
CC(C)(C)[Si](C)(C)O[C@H]1C=C2CCN3Cc4cc5OCOc5cc4[C@@H]([C@@H]23)[C@@H]1O
: