Target
Cytochrome P450 3A4
Ligand
BDBM50293601
Substrate
Meas. Tech.
ChEMBL_571408 (CHEMBL1029448)
Ki
210±n/a nM
Citation
 McNulty, JNair, JJSingh, MCrankshaw, DJHolloway, ACBastida, J Selective cytochrome P450 3A4 inhibitory activity of Amaryllidaceae alkaloids. Bioorg Med Chem Lett 19:3233-7 (2009)  
Target
Name:
Cytochrome P450 3A4
Synonyms:
Albendazole monooxygenase CP3A4_HUMAN CYP3A4 CYPIIIA4 Cytochrome P450 3A4 (CYP3A4) Nifedipine oxidase Taurochenodeoxycholate 6-alpha-hydroxylase
Type:
Enzyme
Mol. Mass.:
57349.57
Organism:
Homo sapiens (Human)
Description:
Residue:
503
  
Inhibitor
Name:
BDBM50293601
Synonyms:
(1S,2S,3a1S,12bS)-2-(tert-butyldimethylsilyloxy)-2,3a1,4,5,7,12b-hexahydro-1H-[1,3]dioxolo[4,5-j]pyrrolo[3,2,1-de]phenanthridin-1-yl acetate CHEMBL564408
Type:
Small organic molecule
Emp. Form.:
C24H33NO5Si
Mol. Mass.:
443.608
SMILES:
CC(=O)O[C@@H]1[C@@H](O[Si](C)(C)C(C)(C)C)C=C2CCN3Cc4cc5OCOc5cc4[C@H]1[C@@H]23
: