Target
Histamine H3 receptor
Ligand
BDBM27193
Substrate
Meas. Tech.
ChEMBL_572926 (CHEMBL1036178)
Ki
5.37±n/a nM
Citation
 Zhao, CSun, MBennani, YLMiller, TRWitte, DGEsbenshade, TAWetter, JMarsh, KCHancock, AABrioni, JDCowart, MD Design of a new histamine H3 receptor antagonist chemotype: (3aR,6aR)-5-alkyl-1-aryl-octahydropyrrolo[3,4-b]pyrroles, synthesis, and structure-activity relationships. J Med Chem 52:4640-9 (2009)  
Target
Name:
Histamine H3 receptor
Synonyms:
G-protein coupled receptor 97 HH3R HRH3 Histamine H3 receptor (H3) Histamine receptor (H3 and H4)
Type:
G Protein-Coupled Receptor (GPCR)
Mol. Mass.:
48691.47
Organism:
Homo sapiens (Human)
Description:
Binding assays were using CHO cells stably expressing hH3R receptors.
Residue:
445
  
Inhibitor
Name:
BDBM27193
Synonyms:
(1R,2S,5S,6S,9R,12S,13R,16S)-N,N,6,7,13-pentamethyl-7-azapentacyclo[10.8.0.0^{2,9}.0^{5,9}.0^{13,18}]icos-18-en-16-amine | Conessine
Type:
Alkaloid
Emp. Form.:
C24H40N2
Mol. Mass.:
356.5878
SMILES:
[H][C@@]1(C)N(C)C[C@]23CC[C@@]4([H])[C@@]([H])(CC=C5C[C@H](CC[C@]45C)N(C)C)[C@]2([H])CC[C@]13[H]
: