Target
Delta-type opioid receptor
Ligand
BDBM50295263
Substrate
Meas. Tech.
ChEMBL_577733 (CHEMBL1052368)
IC50
140000±n/a nM
Citation
 Torino, DMollica, APinnen, FLucente, GFeliciani, FDavis, PLai, JMa, SWPorreca, FHruby, VJ Synthesis and evaluation of new endomorphin analogues modified at the Pro(2) residue. Bioorg Med Chem Lett 19:4115-8 (2009)  
Target
Name:
Delta-type opioid receptor
Synonyms:
DOR-1 MSL-2 OPRD_MOUSE Oprd1
Type:
Enzyme Catalytic Domain
Mol. Mass.:
40577.25
Organism:
MOUSE
Description:
P32300
Residue:
372
  
Inhibitor
Name:
BDBM50295263
Synonyms:
(S)-N-((S)-1-((S)-1-amino-1-oxo-3-phenylpropan-2-ylamino)-3-(1H-indol-3-yl)-1-oxopropan-2-yl)-1-((S)-2-amino-3-(4-hydroxyphenyl)propanoyl)azetidine-2-carboxamide | CHEMBL552133
Type:
Small organic molecule
Emp. Form.:
C33H36N6O5
Mol. Mass.:
596.6761
SMILES:
N[C@@H](Cc1ccc(O)cc1)C(=O)N1CC[C@H]1C(=O)N[C@@H](Cc1c[nH]c2ccccc12)C(=O)N[C@@H](Cc1ccccc1)C(N)=O
: