Target
Fatty acid-binding protein, liver
Ligand
BDBM28700
Substrate
Meas. Tech.
ChEMBL_578550 (CHEMBL1052392)
Kd
420±n/a nM
Citation
 Chuang, SVelkov, THorne, JWielens, JChalmers, DKPorter, CJScanlon, MJ Probing the fibrate binding specificity of rat liver fatty acid binding protein. J Med Chem 52:5344-55 (2009)  
Target
Name:
Fatty acid-binding protein, liver
Synonyms:
FABPL_RAT Fatty acid-binding protein, liver | Liver fatty acid binding protein (rat L-FABP)
Type:
Protein
Mol. Mass.:
14274.39
Organism:
Rattus norvegicus (Rat)
Description:
rat L-FABP
Residue:
127
  
Inhibitor
Name:
BDBM28700
Synonyms:
2-(4-(4-Chlorobenzoyl)phenoxy)-2-methylpropionic acid CHEMBL981 FIBRICOR LF 153 procetofenic acid
Type:
Small organic molecule
Emp. Form.:
C17H15ClO4
Mol. Mass.:
318.752
SMILES:
CC(C)(Oc1ccc(cc1)C(=O)c1ccc(Cl)cc1)C(O)=O
: