Target
Sialidase-2
Ligand
BDBM50295841
Substrate
Meas. Tech.
ChEMBL_578462 (CHEMBL1062266)
Ki
307000±n/a nM
Citation
 Magesh, SSavita, VMoriya, SSuzuki, TMiyagi, TIshida, HKiso, M Human sialidase inhibitors: design, synthesis, and biological evaluation of 4-acetamido-5-acylamido-2-fluoro benzoic acids. Bioorg Med Chem 17:4595-603 (2009)  
Target
Name:
Sialidase-2
Synonyms:
Cytosolic sialidase NEU2 Sialidase 2 | Sialidase-2
Type:
PROTEIN
Mol. Mass.:
42256.20
Organism:
Homo sapiens (Human)
Description:
ChEMBL_960638
Residue:
380
  
Inhibitor
Name:
BDBM50295841
Synonyms:
4-Acetamido-5-(biphenyl-4-ylcarboxamido)-2-fluorobenzoic acid | CHEMBL559396
Type:
Small organic molecule
Emp. Form.:
C22H17FN2O4
Mol. Mass.:
392.3798
SMILES:
CC(=O)Nc1cc(F)c(cc1NC(=O)c1ccc(cc1)-c1ccccc1)C(O)=O
: