Target
Mitogen-activated protein kinase 13
Ligand
BDBM50296636
Substrate
Meas. Tech.
ChEMBL_582356 (CHEMBL1063393)
IC50
4±n/a nM
Citation
 Wurz, RPPettus, LHXu, SHenkle, BSherman, LPlant, MMiner, KMcBride, HWong, LMSaris, CJLee, MRChmait, SMohr, CHsieh, FTasker, AS Part 1: Structure-Activity Relationship (SAR) investigations of fused pyrazoles as potent, selective and orally available inhibitors of p38alpha mitogen-activated protein kinase. Bioorg Med Chem Lett 19:4724-8 (2009)  
Target
Name:
Mitogen-activated protein kinase 13
Synonyms:
MAP kinase p38 delta MK13_HUMAN Mitogen-activated protein kinase 13 (MAPK13) Mitogen-activated protein kinase p38 delta SAPK4 p38 delta/gamma
Type:
Enzyme
Mol. Mass.:
42097.16
Organism:
Homo sapiens (Human)
Description:
O15264
Residue:
365
  
Inhibitor
Name:
BDBM50296636
Synonyms:
4-chloro-N-cyclopropyl-3-(1-(4-fluorophenyl)-7-methyl-6-oxo-6,7-dihydro-1H-pyrazolo[3,4-b]pyridin-4-ylamino)benzamide | CHEMBL561932
Type:
Small organic molecule
Emp. Form.:
C23H19ClFN5O2
Mol. Mass.:
451.881
SMILES:
Cn1c2n(ncc2c(Nc2cc(ccc2Cl)C(=O)NC2CC2)cc1=O)-c1ccc(F)cc1
: