Target
A disintegrin and metalloproteinase with thrombospondin motifs 4
Ligand
BDBM50297233
Substrate
Meas. Tech.
ChEMBL_581475 (CHEMBL1055719)
IC50
2200±n/a nM
Citation
 Li, WHu, YLi, JThomason, JRDeVincentis, DDu, XWu, JHotchandani, RRush, TSSkotnicki, JSTam, SChockalingam, PSMorris, EALevin, JI 3,4-Disubstituted benzofuran P1' MMP-13 inhibitors: optimization of selectivity and reduction of protein binding. Bioorg Med Chem Lett 19:4546-50 (2009)  
Target
Name:
A disintegrin and metalloproteinase with thrombospondin motifs 4
Synonyms:
A disintegrin and metalloproteinase with thrombospondin motifs 4 (ADAMTS-4) ATS4_HUMAN KIAA0688 | Metalloproteinase with thrombospondin motifs 4 (ADAMTS-4)
Type:
Enzyme
Mol. Mass.:
90214.54
Organism:
Homo sapiens (Human)
Description:
O75173
Residue:
837
  
Inhibitor
Name:
BDBM50297233
Synonyms:
(S)-3-methyl-2-(4'-(3-methyl-4-(methylsulfonamido)benzofuran-2-carboxamido)biphenyl-4-ylsulfonamido)butanoic acid | CHEMBL562003
Type:
Small organic molecule
Emp. Form.:
C28H29N3O8S2
Mol. Mass.:
599.675
SMILES:
CC(C)[C@H](NS(=O)(=O)c1ccc(cc1)-c1ccc(NC(=O)c2oc3cccc(NS(C)(=O)=O)c3c2C)cc1)C(O)=O
: