Target
72 kDa type IV collagenase
Ligand
BDBM50173227
Substrate
Meas. Tech.
ChEMBL_581467 (CHEMBL1055711)
IC50
1050±n/a nM
Citation
 Li, WHu, YLi, JThomason, JRDeVincentis, DDu, XWu, JHotchandani, RRush, TSSkotnicki, JSTam, SChockalingam, PSMorris, EALevin, JI 3,4-Disubstituted benzofuran P1' MMP-13 inhibitors: optimization of selectivity and reduction of protein binding. Bioorg Med Chem Lett 19:4546-50 (2009)  
Target
Name:
72 kDa type IV collagenase
Synonyms:
72 kDa gelatinase CLG4A Gelatinase A (MMP-2) MMP2_HUMAN Matrix metalloproteinase-2 (MMP 2) Matrix metalloproteinases 2 (MMP-2) | TBE-1
Type:
Enzyme
Mol. Mass.:
73870.36
Organism:
Homo sapiens (Human)
Description:
P08253
Residue:
660
  
Inhibitor
Name:
BDBM50173227
Synonyms:
(S)-2-(4'-(4-methoxy-3-methylbenzofuran-2-carboxamido)biphenyl-4-ylsulfonamido)-3-methylbutanoic acid CHEMBL370351
Type:
Small organic molecule
Emp. Form.:
C28H28N2O7S
Mol. Mass.:
536.596
SMILES:
COc1cccc2oc(C(=O)Nc3ccc(cc3)-c3ccc(cc3)S(=O)(=O)N[C@@H](C(C)C)C(O)=O)c(C)c12
: