Target
Collagenase 3
Ligand
BDBM50297230
Substrate
Meas. Tech.
ChEMBL_581466 (CHEMBL1055710)
IC50
8±n/a nM
Citation
 Li, WHu, YLi, JThomason, JRDeVincentis, DDu, XWu, JHotchandani, RRush, TSSkotnicki, JSTam, SChockalingam, PSMorris, EALevin, JI 3,4-Disubstituted benzofuran P1' MMP-13 inhibitors: optimization of selectivity and reduction of protein binding. Bioorg Med Chem Lett 19:4546-50 (2009)  
Target
Name:
Collagenase 3
Synonyms:
MMP-13 MMP13_HUMAN Matrix metalloproteinase-13 (MMP-13) | Matrix metalloproteinase-13 (MMP13)
Type:
Enzyme
Mol. Mass.:
53808.06
Organism:
Homo sapiens (Human)
Description:
P45452
Residue:
471
  
Inhibitor
Name:
BDBM50297230
Synonyms:
(S)-3-methyl-2-(4'-(3-methyl-4-(methylamino)benzofuran-2-carboxamido)biphenyl-4-ylsulfonamido)butanoic acid | CHEMBL551611
Type:
Small organic molecule
Emp. Form.:
C28H29N3O6S
Mol. Mass.:
535.611
SMILES:
CNc1cccc2oc(C(=O)Nc3ccc(cc3)-c3ccc(cc3)S(=O)(=O)N[C@@H](C(C)C)C(O)=O)c(C)c12
: