Target
Collagenase 3
Ligand
BDBM50297231
Substrate
Meas. Tech.
ChEMBL_581466 (CHEMBL1055710)
IC50
6.5±n/a nM
Citation
 Li, WHu, YLi, JThomason, JRDeVincentis, DDu, XWu, JHotchandani, RRush, TSSkotnicki, JSTam, SChockalingam, PSMorris, EALevin, JI 3,4-Disubstituted benzofuran P1' MMP-13 inhibitors: optimization of selectivity and reduction of protein binding. Bioorg Med Chem Lett 19:4546-50 (2009)  
Target
Name:
Collagenase 3
Synonyms:
MMP-13 MMP13_HUMAN Matrix metalloproteinase-13 (MMP-13) | Matrix metalloproteinase-13 (MMP13)
Type:
Enzyme
Mol. Mass.:
53808.06
Organism:
Homo sapiens (Human)
Description:
P45452
Residue:
471
  
Inhibitor
Name:
BDBM50297231
Synonyms:
(S)-2-(4'-(4-(dimethylamino)-3-methylbenzofuran-2-carboxamido)biphenyl-4-ylsulfonamido)-3-methylbutanoic acid | CHEMBL564232
Type:
Small organic molecule
Emp. Form.:
C29H31N3O6S
Mol. Mass.:
549.638
SMILES:
CC(C)[C@H](NS(=O)(=O)c1ccc(cc1)-c1ccc(NC(=O)c2oc3cccc(N(C)C)c3c2C)cc1)C(O)=O
: