Target
72 kDa type IV collagenase
Ligand
BDBM50297242
Substrate
Meas. Tech.
ChEMBL_581467 (CHEMBL1055711)
IC50
3650±n/a nM
Citation
 Li, WHu, YLi, JThomason, JRDeVincentis, DDu, XWu, JHotchandani, RRush, TSSkotnicki, JSTam, SChockalingam, PSMorris, EALevin, JI 3,4-Disubstituted benzofuran P1' MMP-13 inhibitors: optimization of selectivity and reduction of protein binding. Bioorg Med Chem Lett 19:4546-50 (2009)  
Target
Name:
72 kDa type IV collagenase
Synonyms:
72 kDa gelatinase CLG4A Gelatinase A (MMP-2) MMP2_HUMAN Matrix metalloproteinase-2 (MMP 2) Matrix metalloproteinases 2 (MMP-2) | TBE-1
Type:
Enzyme
Mol. Mass.:
73870.36
Organism:
Homo sapiens (Human)
Description:
P08253
Residue:
660
  
Inhibitor
Name:
BDBM50297242
Synonyms:
(S)-3-methyl-2-(4'-(3-methyl-4-phenylbenzofuran-2-carboxamido)biphenyl-4-ylsulfonamido)butanoic acid | CHEMBL541703
Type:
Small organic molecule
Emp. Form.:
C33H30N2O6S
Mol. Mass.:
582.666
SMILES:
CC(C)[C@H](NS(=O)(=O)c1ccc(cc1)-c1ccc(NC(=O)c2oc3cccc(-c4ccccc4)c3c2C)cc1)C(O)=O
: