Target
72 kDa type IV collagenase
Ligand
BDBM50297244
Substrate
Meas. Tech.
ChEMBL_581467 (CHEMBL1055711)
IC50
2840±n/a nM
Citation
 Li, WHu, YLi, JThomason, JRDeVincentis, DDu, XWu, JHotchandani, RRush, TSSkotnicki, JSTam, SChockalingam, PSMorris, EALevin, JI 3,4-Disubstituted benzofuran P1' MMP-13 inhibitors: optimization of selectivity and reduction of protein binding. Bioorg Med Chem Lett 19:4546-50 (2009)  
Target
Name:
72 kDa type IV collagenase
Synonyms:
72 kDa gelatinase CLG4A Gelatinase A (MMP-2) MMP2_HUMAN Matrix metalloproteinase-2 (MMP 2) Matrix metalloproteinases 2 (MMP-2) | TBE-1
Type:
Enzyme
Mol. Mass.:
73870.36
Organism:
Homo sapiens (Human)
Description:
P08253
Residue:
660
  
Inhibitor
Name:
BDBM50297244
Synonyms:
(S)-2-(4-(5-(4-cyanobenzofuran-2-carboxamido)pyridin-2-yl)phenylsulfonamido)-3-methylbutanoic acid | CHEMBL559805
Type:
Small organic molecule
Emp. Form.:
C26H22N4O6S
Mol. Mass.:
518.541
SMILES:
CC(C)[C@H](NS(=O)(=O)c1ccc(cc1)-c1ccc(NC(=O)c2cc3c(cccc3o2)C#N)cn1)C(O)=O
: