Target
Caspase-3
Ligand
BDBM10315
Substrate
Meas. Tech.
ChEMBL_582859 (CHEMBL1061695)
IC50
31±n/a nM
Citation
 Lakshmi, PJKumar, BVNayana, RSMohan, MSBolligarla, RDas, SKBhanu, MUKondapi, AKRavikumar, M Design, synthesis, and discovery of novel non-peptide inhibitor of Caspase-3 using ligand based and structure based virtual screening approach. Bioorg Med Chem 17:6040-7 (2009)  
Target
Name:
Caspase-3
Synonyms:
Apopain CASP3 CPP-32 Caspase 3 Caspase-3 subunit p17 SCA-1 Yama protein | caspase-3 preproprotein
Type:
Hydrolase; heterotetramer of two heterodimers
Mol. Mass.:
31607.55
Organism:
Homo sapiens (Human)
Description:
Residue:
277
  
Inhibitor
Name:
BDBM10315
Synonyms:
(S)-5-{1-[2-(Anilinomethyl)pyrrolidinyl]sulfonyl}isatin Isatin Sulfonamide 26
Type:
Small organic molecule
Emp. Form.:
C19H19N3O4S
Mol. Mass.:
385.437
SMILES:
O=C1Nc2ccc(cc2C1=O)S(=O)(=O)N1CCC[C@H]1CNc1ccccc1
: