Target
Macrophage migration inhibitory factor
Ligand
BDBM50298008
Substrate
Meas. Tech.
ChEMBL_585089 (CHEMBL1054355)
IC50
12000±n/a nM
Citation
 Balachandran, SRodge, AGadekar, PKYadav, VNKamath, DChetrapal-Kunwar, ABhatt, PSrinivasan, SSharma, SVishwakarma, RADagia, NM Novel derivatives of ISO-1 as potent inhibitors of MIF biological function. Bioorg Med Chem Lett 19:4773-6 (2009)  
Target
Name:
Macrophage migration inhibitory factor
Synonyms:
GIF Glycosylation-inhibiting factor L-dopachrome tautomerase MIF/CD74 (Macrophage migration inhibitory factor and HLA-DR antigens-associated invariant chain) MMIF Macrophage migration inhibitory factor (MIF) | Phenylpyruvate tautomerase
Type:
Enzyme
Mol. Mass.:
12478.18
Organism:
Homo sapiens (Human)
Description:
P14174
Residue:
115
  
Inhibitor
Name:
BDBM50298008
Synonyms:
3-(3-(3-(3-fluoro-4-methoxyphenyl)-4,5-dihydroisoxazole-5-yl)-1,2,4-oxadaizole-5-yl)propanoic acid | CHEMBL559951
Type:
Small organic molecule
Emp. Form.:
C15H14FN3O5
Mol. Mass.:
335.2872
SMILES:
COc1ccc(cc1F)C1=NOC(C1)c1noc(CCC(O)=O)n1
: