Target
Aminopeptidase N
Ligand
BDBM50298269
Substrate
Meas. Tech.
ChEMBL_588447 (CHEMBL1040345)
IC50
60200±n/a nM
Citation
 Mou, JFang, HJing, FWang, QLiu, YZhu, HShang, LWang, XXu, W Design, synthesis and primary activity evaluation of L-arginine derivatives as amino-peptidase N/CD13 inhibitors. Bioorg Med Chem 17:4666-73 (2009)  
Target
Name:
Aminopeptidase N
Synonyms:
AMPN_PIG AP-M Alanyl aminopeptidase Aminopeptidase N (APN) Microsomal aminopeptidase pAPN
Type:
Protein
Mol. Mass.:
108810.25
Organism:
Sus scrofa (Pig)
Description:
P15145
Residue:
963
  
Inhibitor
Name:
BDBM50298269
Synonyms:
CHEMBL575397 | N-Hydroxy-5-(3-nitroguanidino)-2-(phenylsulfonamido)pentanamide
Type:
Small organic molecule
Emp. Form.:
C12H18N6O6S
Mol. Mass.:
374.373
SMILES:
NC(NCCC[C@H](NS(=O)(=O)c1ccccc1)C(=O)NO)=N[N+]([O-])=O
: