Target
Sterol O-acyltransferase 1
Ligand
BDBM50298279
Substrate
Meas. Tech.
ChEMBL_588465 (CHEMBL1040363)
IC50
62±n/a nM
Citation
 Asano, SBan, HKino, KIoriya, KMuraoka, M Synthesis and structure-activity relationships of N-(4-amino-2,6-diisopropylphenyl)-N'-(1,4-diarylpiperidine-4-yl)methylureas as anti-hyperlipidemic agents. Bioorg Med Chem 17:4636-46 (2009)  
Target
Name:
Sterol O-acyltransferase 1
Synonyms:
ACAT-1 Acat SOAT1_RAT Sterol O-acyltransferase, Soat
Type:
PROTEIN
Mol. Mass.:
64165.56
Organism:
Rattus norvegicus
Description:
ChEMBL_28796
Residue:
545
  
Inhibitor
Name:
BDBM50298279
Synonyms:
CHEMBL574388 | N-(4-Amino-2,6-diisopropylphenyl)-N'-{[4-[3-(3-hydroxypropoxy)phenyl]-1-(2-methoxyphenyl)piperidin-4-yl]-methyl}urea dihydrochloride
Type:
Small organic molecule
Emp. Form.:
C35H48N4O4
Mol. Mass.:
588.78
SMILES:
COc1ccccc1N1CCC(CNC(=O)Nc2c(cc(N)cc2C(C)C)C(C)C)(CC1)c1cccc(OCCCO)c1
: