Target
Sterol O-acyltransferase 1
Ligand
BDBM50276564
Substrate
Meas. Tech.
ChEMBL_588465 (CHEMBL1040363)
IC50
68±n/a nM
Citation
 Asano, SBan, HKino, KIoriya, KMuraoka, M Synthesis and structure-activity relationships of N-(4-amino-2,6-diisopropylphenyl)-N'-(1,4-diarylpiperidine-4-yl)methylureas as anti-hyperlipidemic agents. Bioorg Med Chem 17:4636-46 (2009)  
Target
Name:
Sterol O-acyltransferase 1
Synonyms:
ACAT-1 Acat SOAT1_RAT Sterol O-acyltransferase, Soat
Type:
PROTEIN
Mol. Mass.:
64165.56
Organism:
Rattus norvegicus
Description:
ChEMBL_28796
Residue:
545
  
Inhibitor
Name:
BDBM50276564
Synonyms:
1-(4-amino-2,6-diisopropylphenyl)-3-((4-(3-methoxyphenyl)-1-(2-(trifluoromethoxy)phenyl)piperidin-4-yl)methyl)urea dihydrochloride | CHEMBL509834
Type:
Small organic molecule
Emp. Form.:
C33H41F3N4O3
Mol. Mass.:
598.6988
SMILES:
COc1cccc(c1)C1(CNC(=O)Nc2c(cc(N)cc2C(C)C)C(C)C)CCN(CC1)c1ccccc1OC(F)(F)F
: