Target
Sterol O-acyltransferase 1
Ligand
BDBM50175765
Substrate
Meas. Tech.
ChEMBL_588465 (CHEMBL1040363)
IC50
31±n/a nM
Citation
 Asano, SBan, HKino, KIoriya, KMuraoka, M Synthesis and structure-activity relationships of N-(4-amino-2,6-diisopropylphenyl)-N'-(1,4-diarylpiperidine-4-yl)methylureas as anti-hyperlipidemic agents. Bioorg Med Chem 17:4636-46 (2009)  
Target
Name:
Sterol O-acyltransferase 1
Synonyms:
ACAT-1 Acat SOAT1_RAT Sterol O-acyltransferase, Soat
Type:
PROTEIN
Mol. Mass.:
64165.56
Organism:
Rattus norvegicus
Description:
ChEMBL_28796
Residue:
545
  
Inhibitor
Name:
BDBM50175765
Synonyms:
1-(4-amino-2,6-diisopropylphenyl)-3-(1-butyl-4-(3-(3-hydroxypropoxy)phenyl)-2-oxo-1,2-dihydro-1,8-naphthyridin-3-yl)urea hydrochloride CHEMBL539597 | CHEMBL573970
Type:
Small organic molecule
Emp. Form.:
C34H43N5O4
Mol. Mass.:
585.7363
SMILES:
CCCCn1c2ncccc2c(-c2cccc(OCCCO)c2)c(NC(=O)Nc2c(cc(N)cc2C(C)C)C(C)C)c1=O
: