Target
Dihydrofolate reductase
Ligand
BDBM18490
Substrate
Meas. Tech.
ChEMBL_588095 (CHEMBL1044821)
IC50
180±n/a nM
Citation
 Paulsen, JLLiu, JBolstad, DBSmith, AEPriestley, NDWright, DLAnderson, AC In vitro biological activity and structural analysis of 2,4-diamino-5-(2'-arylpropargyl)pyrimidine inhibitors of Candida albicans. Bioorg Med Chem 17:4866-72 (2009)  
Target
Name:
Dihydrofolate reductase
Synonyms:
DFR1 Dihydrofolate Reductase (DHFR) | Tetrahydrofolate dehydrogenase
Type:
Enzyme
Mol. Mass.:
22141.77
Organism:
Candida albicans
Description:
C. albicans DHFR was expressed in E. coli BL21, and purified to homogeneity.
Residue:
192
  
Inhibitor
Name:
BDBM18490
Synonyms:
6-methyl-5-[3-(3,4,5-trimethoxyphenyl)prop-1-yn-1-yl]pyrimidine-2,4-diamine Propargyl-linked, 5 TMP derivative with propargyl-based linker, 16
Type:
Small organic molecule
Emp. Form.:
C17H20N4O3
Mol. Mass.:
328.3657
SMILES:
COc1cc(CC#Cc2c(C)nc(N)nc2N)cc(OC)c1OC
: