Target
Cathepsin D
Ligand
BDBM50298996
Substrate
Meas. Tech.
ChEMBL_588260 (CHEMBL1050917)
Ki
>10000±n/a nM
Citation
 Orrling, KMMarzahn, MRGutiérrez-de-Terán, HAqvist, JDunn, BMLarhed, M alpha-Substituted norstatines as the transition-state mimic in inhibitors of multiple digestive vacuole malaria aspartic proteases. Bioorg Med Chem 17:5933-49 (2009)  
Target
Name:
Cathepsin D
Synonyms:
CATD_HUMAN CTSD Cathepsin D heavy chain Cathepsin D precursor
Type:
Enzyme
Mol. Mass.:
44551.72
Organism:
Homo sapiens (Human)
Description:
Human proCathepsin D (SwissProt accession number P07339) was expressed in Sf9 cells, purified, and autoactivated.
Residue:
412
  
Inhibitor
Name:
BDBM50298996
Synonyms:
(R)-3-((R)-2-benzyl-3-(2-(2,6-dimethylphenoxy)acetamido)-2-hydroxypropanoyl)-N-((1S,2R)-2-hydroxy-2,3-dihydro-1H-inden-1-yl)-5,5-dimethylthiazolidine-4-carboxamide | CHEMBL584189
Type:
Small organic molecule
Emp. Form.:
C35H41N3O6S
Mol. Mass.:
631.782
SMILES:
Cc1cccc(C)c1OCC(=O)NC[C@](O)(Cc1ccccc1)C(=O)N1CSC(C)(C)[C@H]1C(=O)N[C@@H]1[C@H](O)Cc2ccccc12
: