Target
Interstitial collagenase
Ligand
BDBM50299068
Substrate
Meas. Tech.
ChEMBL_591603 (CHEMBL1042356)
IC50
>100000±n/a nM
Citation
 Nuti, EPanelli, LCasalini, FAvramova, SIOrlandini, ESantamaria, SNencetti, STuccinardi, TMartinelli, ACercignani, GD'Amelio, NMaiocchi, AUggeri, FRossello, A Design, synthesis, biological evaluation, and NMR studies of a new series of arylsulfones as selective and potent matrix metalloproteinase-12 inhibitors. J Med Chem 52:6347-61 (2009)  
Target
Name:
Interstitial collagenase
Synonyms:
CLG MMP1 Matrix metalloproteinase-1 | Matrix metalloproteinase-1 (MMP-1)
Type:
Enzyme
Mol. Mass.:
54010.26
Organism:
Homo sapiens (Human)
Description:
P03956
Residue:
469
  
Inhibitor
Name:
BDBM50299068
Synonyms:
CHEMBL575895 | N-Hydroxy-2-(4-methoxy-benzenesulfonyl)benzamide
Type:
Small organic molecule
Emp. Form.:
C14H13NO5S
Mol. Mass.:
307.322
SMILES:
COc1ccc(cc1)S(=O)(=O)c1ccccc1C(=O)NO
: