Target
Receptor-type tyrosine-protein phosphatase F
Ligand
BDBM14258
Substrate
Meas. Tech.
ChEMBL_590756 (CHEMBL1050898)
Ki
320000±n/a nM
Citation
 Vidovic, DSchürer, SC Knowledge-based characterization of similarity relationships in the human protein-tyrosine phosphatase family for rational inhibitor design. J Med Chem 52:6649-59 (2009)  
Target
Name:
Receptor-type tyrosine-protein phosphatase F
Synonyms:
LAR Leukocyte common antigen related (LAR) PTPRF_HUMAN Receptor-type tyrosine-protein phosphatase F (LAR)
Type:
Protein
Mol. Mass.:
212869.85
Organism:
Homo sapiens (Human)
Description:
P10586
Residue:
1907
  
Inhibitor
Name:
BDBM14258
Synonyms:
4-bromo-3-(carboxymethoxy)-5-[4-(pyridine-3-amido)phenyl]thiophene-2-carboxylic acid Monocyclic thiophene analog 27
Type:
Small organic molecule
Emp. Form.:
C19H13BrN2O6S
Mol. Mass.:
477.285
SMILES:
OC(=O)COc1c(Br)c(sc1C(O)=O)-c1ccc(NC(=O)c2cccnc2)cc1
: