Target
Receptor-type tyrosine-protein phosphatase F
Ligand
BDBM50118778
Substrate
Meas. Tech.
ChEMBL_590756 (CHEMBL1050898)
Ki
420000±n/a nM
Citation
 Vidovic, DSchürer, SC Knowledge-based characterization of similarity relationships in the human protein-tyrosine phosphatase family for rational inhibitor design. J Med Chem 52:6649-59 (2009)  
Target
Name:
Receptor-type tyrosine-protein phosphatase F
Synonyms:
LAR Leukocyte common antigen related (LAR) PTPRF_HUMAN Receptor-type tyrosine-protein phosphatase F (LAR)
Type:
Protein
Mol. Mass.:
212869.85
Organism:
Homo sapiens (Human)
Description:
P10586
Residue:
1907
  
Inhibitor
Name:
BDBM50118778
Synonyms:
5-iodo-2-(oxaloamino)benzoic acid | CHEMBL336908
Type:
Small organic molecule
Emp. Form.:
C9H6INO5
Mol. Mass.:
335.0521
SMILES:
OC(=O)C(=O)Nc1ccc(I)cc1C(O)=O
: